{"text_format":"1","workbook":"xlsx","n_sheets":4,"sheets":["要請書","事業報告書","集計","消さないでください"],"not_rendered":{"charts":0,"images":0,"macros":1,"external_links":0,"defined_names":4,"comments":2,"pivot_tables":0},"unopened":[],"bounds":{"document_bytes":16777216,"sheet_cells":100000,"rows_first":2000,"rows_last":500,"rows_between":2000,"halvings":0,"cell_chars":16384,"cell_head_chars":4096},"cells_cut":0,"cells_raw":0,"read":"whole","date_system":"1900"}

{"sheet":"要請書","index":0,"n_rows":31,"n_cols":10,"rows_kept":31,"cut":false,"hidden":false,"merged":[[25,0,27,9]]}
["(別紙１)",null,null,null,null,null,null,null,null,"　　　　第　　　　　　号"]
[null,null,null,null,null,null,null,null,null,"　　　　　年　　月　　日"]
[]
["　　派遣元所属長　様"]
[]
[null,null,null,null,null,null,null,"申込者","学校名"]
[null,null,null,null,null,null,null,null,"職・氏名"]
[]
[null,"エキスパート職員派遣要請書"]
[]
["派遣先学校名"]
["派遣先学校\n授業者職・氏名"]
["派遣先学校連絡先"]
["　郵便番号",null,null,"(ハイフンなしで記載)"]
["　住　所",{"$f":"IF(ISERROR(VLOOKUP(B14,消さないでください!C1:I1602,5,FALSE)),\"\",VLOOKUP(B14,消さないでください!C1:I1602,5,FALSE))","v":""},null,{"$f":"IF(ISERROR(VLOOKUP(B14,消さないでください!C1:I1602,6,FALSE)),\"\",VLOOKUP(B14,消さないでください!C1:I1602,6,FALSE))","v":""}]
["　電話番号"]
["　E-mail"]
["派遣希望日時",null,null,{"$f":"IF(B18=\"\",\"\",TEXT(B18,\"(aaa)\"))","v":""}]
[null,null,":",null,"~",null,":"]
["「出前授業」実施場所"]
["エキスパート職員の所属・氏名"]
["「出前授業」の対象者",null,null,"学年",null,null,null,"名"]
["「出前授業」希望分野"]
["「出前授業」を活用する単元名"]
["｢出前授業｣を通じた学習のねらい・目標（注）"]
[]
[]
[]
[]
[]
["（注）学習のねらい・目標を達成するために必要な、エキスパート職員と授業者との役割分担も記入すること。"]

{"sheet":"事業報告書","index":1,"n_rows":36,"n_cols":11,"rows_kept":36,"cut":false,"hidden":false,"merged":[]}
["(別紙２)",null,null,null,null,null,null,null,null,"　　　　第　　　　　　号"]
[null,null,null,null,null,null,null,null,null,"　　　　　年　　月　　日"]
[]
[null,"エキスパート職員派遣事業報告書"]
[]
["派遣先学校名",{"$f":"IF(要請書!B11=\"\",\"\",要請書!B11)","v":""}]
["派遣先学校\n授業者職・氏名",{"$f":"IF(要請書!B12=\"\",\"\",要請書!B12)","v":""}]
["派遣日時",{"$f":"IF(要請書!B18=\"\",\"\",要請書!B18)","v":""},null,{"$f":"要請書!D18","v":""},null,null,null,{"$f":"IF(ISERROR(TEXT(K8,\"(aaa)\")),\"\",TEXT(K8,\"(aaa)\"))","v":""},null,null,{"$f":"DATE(B8,D8,F8)","v":{"$error":"#VALUE!"}}]
[null,null,":",null,"~",null,":"]
["エキスパート職員の所属・氏名"]
["「出前授業」の対象者",null,null,"学年",null,null,null,"名"]
["「出前授業」の内容（学習内容、児童生徒の様子、学習のねらい・目標が達成されたか等）"]
[]
[]
[]
[]
[]
[]
[]
[]
[]
[]
[]
[]
[]
[]
[]
[]
[]
[]
[]
[]
[]
[]
[]
["その他、本事業へのご意見やご要望等がありましたら、ご自由にご記入ください。"]

{"sheet":"集計","index":2,"n_rows":17,"n_cols":14,"rows_kept":17,"cut":false,"hidden":true,"merged":[]}
["番号","市町村","派遣先学校名","派遣先学校\n授業者職・氏名","派遣先学校TEL","派遣先学校E-mail","派遣希望日","エキスパート職員の所属","エキスパート職員名","対象学年","対象人数","テーマ","授業タイトル","実績報告書"]
[]
[]
[]
[]
[]
[]
[]
[]
[]
[]
[]
[]
[]
[]
[]
["シート保護w"]

{"sheet":"消さないでください","index":3,"n_rows":1634,"n_cols":16,"rows_kept":1634,"cut":false,"hidden":true,"merged":[]}
[30201,640,6400000,"ﾜｶﾔﾏｹﾝ","ﾜｶﾔﾏｼ","ｲｶﾆｹｲｻｲｶﾞﾅｲﾊﾞｱｲ","和歌山県","和歌山市","以下に掲載がない場合",0,0,0,0,0,0]
[30201,640,6408273,"ﾜｶﾔﾏｹﾝ","ﾜｶﾔﾏｼ","ｱｵｲﾁｮｳ","和歌山県","和歌山市","葵町",0,0,0,0,0,0]
[30201,640,6408322,"ﾜｶﾔﾏｹﾝ","ﾜｶﾔﾏｼ","ｱｷﾂﾞｷ","和歌山県","和歌山市","秋月",0,0,0,0,0,0]
[30201,641,6410056,"ﾜｶﾔﾏｹﾝ","ﾜｶﾔﾏｼ","ｱｷﾊﾞﾁｮｳ","和歌山県","和歌山市","秋葉町",0,0,0,0,0,0]
[30201,64003,6400344,"ﾜｶﾔﾏｹﾝ","ﾜｶﾔﾏｼ","ｱｻﾋ","和歌山県","和歌山市","朝日",0,0,0,0,0,0]
[30201,640,6408134,"ﾜｶﾔﾏｹﾝ","ﾜｶﾔﾏｼ","ｱｼﾍﾞﾁｮｳ","和歌山県","和歌山市","芦辺丁",0,0,0,0,0,0]
[30201,64963,6496336,"ﾜｶﾔﾏｹﾝ","ﾜｶﾔﾏｼ","ｱｽﾞｼﾏ","和歌山県","和歌山市","小豆島",0,0,0,0,0,0]
[30201,640,6408238,"ﾜｶﾔﾏｹﾝ","ﾜｶﾔﾏｼ","ｱﾐﾔﾏﾁ","和歌山県","和歌山市","網屋町",0,0,0,0,0,0]
[30201,640,6408316,"ﾜｶﾔﾏｹﾝ","ﾜｶﾔﾏｼ","ｱﾘｴ","和歌山県","和歌山市","有家",0,0,0,0,0,0]
[30201,640,6408248,"ﾜｶﾔﾏｹﾝ","ﾜｶﾔﾏｼ","ｱﾘﾀﾞﾔﾏﾁ","和歌山県","和歌山市","有田屋町",0,0,0,0,0,0]
[30201,640,6408246,"ﾜｶﾔﾏｹﾝ","ﾜｶﾔﾏｼ","ｱﾘﾀﾞﾔﾏﾁﾆｼﾉﾁｮｳ","和歌山県","和歌山市","有田屋町西ノ丁",0,0,0,0,0,0]
[30201,640,6408245,"ﾜｶﾔﾏｹﾝ","ﾜｶﾔﾏｼ","ｱﾘﾀﾞﾔﾏﾁﾐﾅﾐﾉﾁｮｳ","和歌山県","和歌山市","有田屋町南ノ丁",0,0,0,0,0,0]
[30201,640,6408390,"ﾜｶﾔﾏｹﾝ","ﾜｶﾔﾏｼ","ｱﾘﾓﾄ","和歌山県","和歌山市","有本",0,0,0,0,0,0]
[30201,640,6408351,"ﾜｶﾔﾏｹﾝ","ﾜｶﾔﾏｼ","ｱﾛﾁ","和歌山県","和歌山市","新内",0,0,0,0,0,0]
[30201,640,6408462,"ﾜｶﾔﾏｹﾝ","ﾜｶﾔﾏｼ","ｱﾜ","和歌山県","和歌山市","粟",0,0,0,0,0,0]
[30201,640,6408201,"ﾜｶﾔﾏｹﾝ","ﾜｶﾔﾏｼ","ｲｼﾊﾞｼﾁｮｳ","和歌山県","和歌山市","石橋丁",0,0,0,0,0,0]
[30201,64001,6400114,"ﾜｶﾔﾏｹﾝ","ﾜｶﾔﾏｼ","ｲｿﾉｳﾗ","和歌山県","和歌山市","磯の浦",0,0,0,0,0,0]
[30201,640,6408044,"ﾜｶﾔﾏｹﾝ","ﾜｶﾔﾏｼ","ｲﾀﾔﾏﾁ","和歌山県","和歌山市","板屋町",0,0,0,0,0,0]
[30201,64003,6400361,"ﾜｶﾔﾏｹﾝ","ﾜｶﾔﾏｼ","ｲﾀﾞｷｿ","和歌山県","和歌山市","伊太祈曽",0,0,0,0,0,0]
[30201,640,6408464,"ﾜｶﾔﾏｹﾝ","ﾜｶﾔﾏｼ","ｲﾁｼｮｳｼﾞ","和歌山県","和歌山市","市小路",0,0,0,0,0,0]
[30201,640,6408146,"ﾜｶﾔﾏｹﾝ","ﾜｶﾔﾏｼ","ｲﾁﾊﾞﾝﾁｮｳ","和歌山県","和歌山市","一番丁",0,0,0,0,0,0]
[30201,640,6408076,"ﾜｶﾔﾏｹﾝ","ﾜｶﾔﾏｼ","ｲﾂｽｼﾞﾒ","和歌山県","和歌山市","五筋目",0,0,0,0,0,0]
[30201,64003,6400352,"ﾜｶﾔﾏｹﾝ","ﾜｶﾔﾏｼ","ｲﾄﾞ","和歌山県","和歌山市","井戸",0,0,0,0,0,0]
[30201,64963,6496323,"ﾜｶﾔﾏｹﾝ","ﾜｶﾔﾏｼ","ｲﾉｸﾁ","和歌山県","和歌山市","井ノ口",0,0,0,0,0,0]
[30201,641,6410044,"ﾜｶﾔﾏｹﾝ","ﾜｶﾔﾏｼ","ｲﾏﾌﾞｸ","和歌山県","和歌山市","今福",0,0,1,0,0,0]
[30201,640,6408301,"ﾜｶﾔﾏｹﾝ","ﾜｶﾔﾏｼ","ｲﾜｾ","和歌山県","和歌山市","岩橋",0,0,0,0,0,0]
[30201,640,6408302,"ﾜｶﾔﾏｹﾝ","ﾜｶﾔﾏｼ","ｲﾝﾍﾞ","和歌山県","和歌山市","井辺",0,0,0,0,0,0]
[30201,64963,6496316,"ﾜｶﾔﾏｹﾝ","ﾜｶﾔﾏｼ","ｳｴﾉ","和歌山県","和歌山市","上野",0,0,0,0,0,0]
[30201,640,6408242,"ﾜｶﾔﾏｹﾝ","ﾜｶﾔﾏｼ","ｳｴﾉﾏﾁ","和歌山県","和歌山市","上野町",0,0,1,0,0,0]
[30201,640,6408298,"ﾜｶﾔﾏｹﾝ","ﾜｶﾔﾏｼ","ｳｴﾏﾂﾁｮｳ","和歌山県","和歌山市","植松丁",0,0,0,0,0,0]
[30201,640,6408078,"ﾜｶﾔﾏｹﾝ","ﾜｶﾔﾏｼ","ｳｼﾞﾃｯﾎﾟｳﾊﾞ","和歌山県","和歌山市","宇治鉄砲場",0,0,0,0,0,0]
[30201,640,6408039,"ﾜｶﾔﾏｹﾝ","ﾜｶﾔﾏｼ","ｳｼﾞﾌｸﾛﾏﾁ","和歌山県","和歌山市","宇治袋町",0,0,0,0,0,0]
[30201,640,6408072,"ﾜｶﾔﾏｹﾝ","ﾜｶﾔﾏｼ","ｳｼﾞﾔｳﾗ","和歌山県","和歌山市","宇治家裏",0,0,0,0,0,0]
[30201,640,6408071,"ﾜｶﾔﾏｹﾝ","ﾜｶﾔﾏｼ","ｳｼﾞﾔﾌﾞｼﾀ","和歌山県","和歌山市","宇治薮下",0,0,0,0,0,0]
[30201,641,6410043,"ﾜｶﾔﾏｹﾝ","ﾜｶﾔﾏｼ","ｳｽﾞ","和歌山県","和歌山市","宇須",0,0,1,0,0,0]
[30201,64963,6496332,"ﾜｶﾔﾏｹﾝ","ﾜｶﾔﾏｼ","ｳﾀﾞﾓﾘ","和歌山県","和歌山市","宇田森",0,0,0,0,0,0]
[30201,641,6410053,"ﾜｶﾔﾏｹﾝ","ﾜｶﾔﾏｼ","ｳﾁｺｼﾁｮｳ","和歌山県","和歌山市","打越町",0,0,0,0,0,0]
[30201,641,6410013,"ﾜｶﾔﾏｹﾝ","ﾜｶﾔﾏｼ","ｳﾁﾊﾗ","和歌山県","和歌山市","内原",0,0,0,0,0,0]
[30201,640,6408452,"ﾜｶﾔﾏｹﾝ","ﾜｶﾔﾏｼ","ｳﾒﾊﾗ","和歌山県","和歌山市","梅原",0,0,0,0,0,0]
[30201,640,6408239,"ﾜｶﾔﾏｹﾝ","ﾜｶﾔﾏｼ","ｳﾜﾏﾁ","和歌山県","和歌山市","上町",0,0,0,0,0,0]
[30201,640,6408335,"ﾜｶﾔﾏｹﾝ","ﾜｶﾔﾏｼ","ｴｻｼﾏﾁ","和歌山県","和歌山市","餌差町",0,0,1,0,0,0]
[30201,64003,6400343,"ﾜｶﾔﾏｹﾝ","ﾜｶﾔﾏｼ","ｴﾅ","和歌山県","和歌山市","江南",0,0,0,0,0,0]
[30201,640,6408434,"ﾜｶﾔﾏｹﾝ","ﾜｶﾔﾏｼ","ｴﾉｷﾊﾗ","和歌山県","和歌山市","榎原",0,0,0,0,0,0]
[30201,64001,6400101,"ﾜｶﾔﾏｹﾝ","ﾜｶﾔﾏｼ","ｵｵｶﾜ","和歌山県","和歌山市","大川",0,0,0,0,0,0]
[30201,64003,6400316,"ﾜｶﾔﾏｹﾝ","ﾜｶﾔﾏｼ","ｵｵｶﾜﾁ","和歌山県","和歌山市","大河内",0,0,0,0,0,0]
[30201,64962,6496272,"ﾜｶﾔﾏｹﾝ","ﾜｶﾔﾏｼ","ｵｵｶﾞｲﾄ","和歌山県","和歌山市","大垣内",0,0,0,0,0,0]
[30201,640,6408472,"ﾜｶﾔﾏｹﾝ","ﾜｶﾔﾏｼ","ｵｵﾀﾆ","和歌山県","和歌山市","大谷",0,0,0,0,0,0]
[30201,640,6408323,"ﾜｶﾔﾏｹﾝ","ﾜｶﾔﾏｼ","ｵｵﾀﾞ","和歌山県","和歌山市","太田",0,0,0,0,0,0]
[30201,640,6408361,"ﾜｶﾔﾏｹﾝ","ﾜｶﾔﾏｼ","ｵｶｴﾝﾌﾟｸｲﾝﾋｶﾞｼﾉﾁｮｳ","和歌山県","和歌山市","岡円福院東ノ丁",0,0,0,0,0,0]
[30201,640,6408364,"ﾜｶﾔﾏｹﾝ","ﾜｶﾔﾏｼ","ｵｶｴﾝﾌﾟｸｲﾝﾆｼﾉﾁｮｳ","和歌山県","和歌山市","岡円福院西ノ丁",0,0,0,0,0,0]
[30201,640,6408362,"ﾜｶﾔﾏｹﾝ","ﾜｶﾔﾏｼ","ｵｶｵﾘﾔｼｮｳｼﾞ","和歌山県","和歌山市","岡織屋小路",0,0,0,0,0,0]
[30201,640,6408365,"ﾜｶﾔﾏｹﾝ","ﾜｶﾔﾏｼ","ｵｶｷﾀﾉﾁｮｳ","和歌山県","和歌山市","岡北ノ丁",0,0,0,0,0,0]
[30201,640,6408363,"ﾜｶﾔﾏｹﾝ","ﾜｶﾔﾏｼ","ｵｶﾐﾅﾐﾉﾁｮｳ","和歌山県","和歌山市","岡南ノ丁",0,0,0,0,0,0]
[30201,640,6408145,"ﾜｶﾔﾏｹﾝ","ﾜｶﾔﾏｼ","ｵｶﾔﾏﾁｮｳ","和歌山県","和歌山市","岡山丁",0,0,0,0,0,0]
[30201,64003,6400362,"ﾜｶﾔﾏｹﾝ","ﾜｶﾔﾏｼ","ｵｸｽﾞｻ","和歌山県","和歌山市","奥須佐",0,0,0,0,0,0]
[30201,64962,6496261,"ﾜｶﾔﾏｹﾝ","ﾜｶﾔﾏｼ","ｵｸﾞﾗ","和歌山県","和歌山市","小倉",0,0,0,0,0,0]
[30201,640,6408271,"ﾜｶﾔﾏｹﾝ","ﾜｶﾔﾏｼ","ｵｻﾞｷﾁｮｳ","和歌山県","和歌山市","尾崎丁",0,0,0,0,0,0]
[30201,64963,6496308,"ﾜｶﾔﾏｹﾝ","ﾜｶﾔﾏｼ","ｵﾁｱｲ","和歌山県","和歌山市","落合",0,0,0,0,0,0]
[30201,640,6408230,"ﾜｶﾔﾏｹﾝ","ﾜｶﾔﾏｼ","ｵﾉｼﾊﾞﾁｮｳ","和歌山県","和歌山市","男野芝丁",0,0,0,0,0,0]
[30201,640,6408224,"ﾜｶﾔﾏｹﾝ","ﾜｶﾔﾏｼ","ｵﾉﾏﾁ","和歌山県","和歌山市","小野町",0,0,1,0,0,0]
[30201,640,6408124,"ﾜｶﾔﾏｹﾝ","ﾜｶﾔﾏｼ","ｵﾏﾂﾁｮｳ","和歌山県","和歌山市","雄松町",0,0,1,0,0,0]
[30201,640,6408073,"ﾜｶﾔﾏｹﾝ","ﾜｶﾔﾏｼ","ｶｹﾂﾞｸﾘﾁｮｳ","和歌山県","和歌山市","嘉家作丁",0,0,0,0,0,0]
[30201,640,6408293,"ﾜｶﾔﾏｹﾝ","ﾜｶﾔﾏｼ","ｶｺﾞﾏﾁ","和歌山県","和歌山市","駕町",0,0,0,0,0,0]
[30201,640,6408139,"ﾜｶﾔﾏｹﾝ","ﾜｶﾔﾏｼ","ｶﾀｵｶﾁｮｳ","和歌山県","和歌山市","片岡町",0,0,1,0,0,0]
[30201,64001,6400103,"ﾜｶﾔﾏｹﾝ","ﾜｶﾔﾏｼ","ｶﾀﾞ","和歌山県","和歌山市","加太",0,0,0,0,0,0]
[30201,640,6408243,"ﾜｶﾔﾏｹﾝ","ﾜｶﾔﾏｼ","ｶﾁﾏﾁ","和歌山県","和歌山市","徒町",0,0,0,0,0,0]
[30201,64962,6496274,"ﾜｶﾔﾏｹﾝ","ﾜｶﾔﾏｼ","ｶﾅﾔ","和歌山県","和歌山市","金谷",0,0,0,0,0,0]
[30201,640,6408391,"ﾜｶﾔﾏｹﾝ","ﾜｶﾔﾏｼ","ｶﾉｳ","和歌山県","和歌山市","加納",0,0,0,0,0,0]
[30201,640,6408288,"ﾜｶﾔﾏｹﾝ","ﾜｶﾔﾏｼ","ｶﾉｳﾏﾁ","和歌山県","和歌山市","加納町",0,0,0,0,0,0]
[30201,64963,6496306,"ﾜｶﾔﾏｹﾝ","ﾜｶﾔﾏｼ","ｶﾐｸﾛﾀﾞﾆ","和歌山県","和歌山市","上黒谷",0,0,0,0,0,0]
[30201,64962,6496262,"ﾜｶﾔﾏｹﾝ","ﾜｶﾔﾏｼ","ｶﾐﾐｹ","和歌山県","和歌山市","上三毛",0,0,0,0,0,0]
[30201,64963,6496312,"ﾜｶﾔﾏｹﾝ","ﾜｶﾔﾏｼ","ｶﾜﾅﾍﾞ","和歌山県","和歌山市","川辺",0,0,0,0,0,0]
[30201,640,6408411,"ﾜｶﾔﾏｹﾝ","ﾜｶﾔﾏｼ","ｶﾝﾄﾞﾘ","和歌山県","和歌山市","梶取",0,0,0,0,0,0]
[30201,64963,6496334,"ﾜｶﾔﾏｹﾝ","ﾜｶﾔﾏｼ","ｷﾀ","和歌山県","和歌山市","北",0,0,0,0,0,0]
[30201,640,6408253,"ﾜｶﾔﾏｹﾝ","ﾜｶﾔﾏｼ","ｷﾀｱｲｵｲﾁｮｳ","和歌山県","和歌山市","北相生丁",0,0,0,0,0,0]
[30201,640,6408299,"ﾜｶﾔﾏｹﾝ","ﾜｶﾔﾏｼ","ｷﾀｳｼﾏﾁ","和歌山県","和歌山市","北牛町",0,0,0,0,0,0]
[30201,640,6408020,"ﾜｶﾔﾏｹﾝ","ﾜｶﾔﾏｼ","ｷﾀｵｹﾔﾏﾁ","和歌山県","和歌山市","北桶屋町",0,0,0,0,0,0]
[30201,640,6408103,"ﾜｶﾔﾏｹﾝ","ﾜｶﾔﾏｼ","ｷﾀｷｭｳｶﾏﾁ","和歌山県","和歌山市","北休賀町",0,0,0,0,0,0]
[30201,640,6408062,"ﾜｶﾔﾏｹﾝ","ﾜｶﾔﾏｼ","ｷﾀｸｷﾞﾇｷﾁｮｳ","和歌山県","和歌山市","北釘貫丁",0,0,0,0,0,0]
[30201,640,6408118,"ﾜｶﾔﾏｹﾝ","ﾜｶﾔﾏｼ","ｷﾀｻｲｸﾏﾁ","和歌山県","和歌山市","北細工町",0,0,0,0,0,0]
[30201,640,6408233,"ﾜｶﾔﾏｹﾝ","ﾜｶﾔﾏｼ","ｷﾀｻｶﾉｳｴﾁｮｳ","和歌山県","和歌山市","北坂ノ上丁",0,0,0,0,0,0]
[30201,640,6408002,"ﾜｶﾔﾏｹﾝ","ﾜｶﾔﾏｼ","ｷﾀｼﾝ","和歌山県","和歌山市","北新",0,0,1,0,0,0]
[30201,640,6408017,"ﾜｶﾔﾏｹﾝ","ﾜｶﾔﾏｼ","ｷﾀｼﾝｴﾋﾞｽﾉﾁｮｳ","和歌山県","和歌山市","北新戎ノ丁",0,0,0,0,0,0]
[30201,640,6408015,"ﾜｶﾔﾏｹﾝ","ﾜｶﾔﾏｼ","ｷﾀｼﾝｵｹﾔﾏﾁ","和歌山県","和歌山市","北新桶屋町",0,0,0,0,0,0]
[30201,640,6408012,"ﾜｶﾔﾏｹﾝ","ﾜｶﾔﾏｼ","ｷﾀｼﾝｶﾅﾔﾁｮｳ","和歌山県","和歌山市","北新金屋丁",0,0,0,0,0,0]
[30201,640,6408001,"ﾜｶﾔﾏｹﾝ","ﾜｶﾔﾏｼ","ｷﾀｼﾝｼﾁｹﾝﾁｮｳ","和歌山県","和歌山市","北新七軒丁",0,0,0,0,0,0]
[30201,640,6408016,"ﾜｶﾔﾏｹﾝ","ﾜｶﾔﾏｼ","ｷﾀｼﾝﾅｶﾉﾁｮｳ","和歌山県","和歌山市","北新中ノ丁",0,0,0,0,0,0]
[30201,640,6408003,"ﾜｶﾔﾏｹﾝ","ﾜｶﾔﾏｼ","ｷﾀｼﾝﾊﾞｸﾛｳﾏﾁ","和歌山県","和歌山市","北新博労町",0,0,0,0,0,0]
[30201,640,6408011,"ﾜｶﾔﾏｹﾝ","ﾜｶﾔﾏｼ","ｷﾀｼﾝﾓﾄｶﾅﾔﾁｮｳ","和歌山県","和歌山市","北新元金屋丁",0,0,0,0,0,0]
[30201,640,6408403,"ﾜｶﾔﾏｹﾝ","ﾜｶﾔﾏｼ","ｷﾀｼﾞﾏ","和歌山県","和歌山市","北島",0,0,0,0,0,0]
[30201,640,6408291,"ﾜｶﾔﾏｹﾝ","ﾜｶﾔﾏｼ","ｷﾀｼﾞﾝｺﾞﾍﾞｴﾁｮｳ","和歌山県","和歌山市","北甚五兵衛丁",0,0,0,0,0,0]
[30201,640,6408252,"ﾜｶﾔﾏｹﾝ","ﾜｶﾔﾏｼ","ｷﾀﾀﾅﾍﾞﾁｮｳ","和歌山県","和歌山市","北田辺丁",0,0,0,0,0,0]
[30201,640,6408031,"ﾜｶﾔﾏｹﾝ","ﾜｶﾔﾏｼ","ｷﾀﾀﾞｲｸﾏﾁ","和歌山県","和歌山市","北大工町",0,0,0,0,0,0]
[30201,640,6408294,"ﾜｶﾔﾏｹﾝ","ﾜｶﾔﾏｼ","ｷﾀﾁｭｳｹﾞﾝﾏﾁ","和歌山県","和歌山市","北中間町",0,0,0,0,0,0]
[30201,640,6408317,"ﾜｶﾔﾏｹﾝ","ﾜｶﾔﾏｼ","ｷﾀﾃﾞｼﾞﾏ","和歌山県","和歌山市","北出島",0,0,1,0,0,0]
[30201,640,6408296,"ﾜｶﾔﾏｹﾝ","ﾜｶﾔﾏｼ","ｷﾀﾄｻﾁｮｳ","和歌山県","和歌山市","北土佐丁",0,0,0,0,0,0]
[30201,641,6410008,"ﾜｶﾔﾏｹﾝ","ﾜｶﾔﾏｼ","ｷﾀﾅｶｼﾞﾏ","和歌山県","和歌山市","北中島",0,0,1,0,0,0]
[30201,64963,6496331,"ﾜｶﾔﾏｹﾝ","ﾜｶﾔﾏｼ","ｷﾀﾉ","和歌山県","和歌山市","北野",0,0,0,0,0,0]
[30201,640,6408355,"ﾜｶﾔﾏｹﾝ","ﾜｶﾔﾏｼ","ｷﾀﾉｼﾝﾁ","和歌山県","和歌山市","北ノ新地",0,0,1,0,0,0]
[30201,640,6408352,"ﾜｶﾔﾏｹﾝ","ﾜｶﾔﾏｼ","ｷﾀﾉｼﾝﾁｳﾗﾀﾏﾁ","和歌山県","和歌山市","北ノ新地裏田町",0,0,0,0,0,0]
[30201,640,6408353,"ﾜｶﾔﾏｹﾝ","ﾜｶﾔﾏｼ","ｷﾀﾉｼﾝﾁｴﾉｷﾁｮｳ","和歌山県","和歌山市","北ノ新地榎丁",0,0,0,0,0,0]
[30201,640,6408356,"ﾜｶﾔﾏｹﾝ","ﾜｶﾔﾏｼ","ｷﾀﾉｼﾝﾁｶﾐﾛｯｹﾝﾁｮｳ","和歌山県","和歌山市","北ノ新地上六軒丁",0,0,0,0,0,0]
[30201,640,6408357,"ﾜｶﾔﾏｹﾝ","ﾜｶﾔﾏｼ","ｷﾀﾉｼﾝﾁﾅｶﾛｯｹﾝﾁｮｳ","和歌山県","和歌山市","北ノ新地中六軒丁",0,0,0,0,0,0]
[30201,640,6408358,"ﾜｶﾔﾏｹﾝ","ﾜｶﾔﾏｼ","ｷﾀﾉｼﾝﾁｼﾓﾛｯｹﾝﾁｮｳ","和歌山県","和歌山市","北ノ新地下六軒丁",0,0,0,0,0,0]
[30201,640,6408359,"ﾜｶﾔﾏｹﾝ","ﾜｶﾔﾏｼ","ｷﾀﾉｼﾝﾁﾀﾏﾁ","和歌山県","和歌山市","北ノ新地田町",0,0,0,0,0,0]
[30201,640,6408354,"ﾜｶﾔﾏｹﾝ","ﾜｶﾔﾏｼ","ｷﾀﾉｼﾝﾁﾋｶﾞｼﾉﾁｮｳ","和歌山県","和歌山市","北ノ新地東ノ丁",0,0,0,0,0,0]
[30201,640,6408350,"ﾜｶﾔﾏｹﾝ","ﾜｶﾔﾏｼ","ｷﾀﾉｼﾝﾁﾌﾝﾄﾞｳﾁｮｳ","和歌山県","和歌山市","北ノ新地分銅丁",0,0,0,0,0,0]
[30201,64963,6496307,"ﾜｶﾔﾏｹﾝ","ﾜｶﾔﾏｼ","ｷﾀﾍﾞｯｼﾖ","和歌山県","和歌山市","北別所",0,0,0,0,0,0]
[30201,640,6408038,"ﾜｶﾔﾏｹﾝ","ﾜｶﾔﾏｼ","ｷﾀﾏﾁ","和歌山県","和歌山市","北町",0,0,0,0,0,0]
[30201,640,6408231,"ﾜｶﾔﾏｹﾝ","ﾜｶﾔﾏｼ","ｷﾀﾐｷﾞﾜﾁｮｳ","和歌山県","和歌山市","北汀丁",0,0,0,0,0,0]
[30201,640,6408412,"ﾜｶﾔﾏｹﾝ","ﾜｶﾔﾏｼ","ｷﾂﾈｼﾞﾏ","和歌山県","和歌山市","狐島",0,0,0,0,0,0]
[30201,640,6408453,"ﾜｶﾔﾏｹﾝ","ﾜｶﾔﾏｼ","ｷﾉﾓﾄ","和歌山県","和歌山市","木ノ本",0,0,0,0,0,0]
[30201,640,6408328,"ﾜｶﾔﾏｹﾝ","ﾜｶﾔﾏｼ","ｷﾋﾛﾁｮｳ","和歌山県","和歌山市","木広町",0,0,1,0,0,0]
[30201,641,6410012,"ﾜｶﾔﾏｹﾝ","ﾜｶﾔﾏｼ","ｷﾐｲﾃﾞﾗ","和歌山県","和歌山市","紀三井寺",0,0,0,0,0,0]
[30201,640,6408244,"ﾜｶﾔﾏｹﾝ","ﾜｶﾔﾏｼ","ｷｭｳｴﾓﾝﾁｮｳ","和歌山県","和歌山市","久右衛門丁",0,0,0,0,0,0]
[30201,640,6408155,"ﾜｶﾔﾏｹﾝ","ﾜｶﾔﾏｼ","ｷｭｳﾊﾞﾝﾁｮｳ","和歌山県","和歌山市","九番丁",0,0,0,0,0,0]
[30201,64003,6400351,"ﾜｶﾔﾏｹﾝ","ﾜｶﾔﾏｼ","ｷﾚ","和歌山県","和歌山市","吉礼",0,0,0,0,0,0]
[30201,640,6408274,"ﾜｶﾔﾏｹﾝ","ﾜｶﾔﾏｼ","ｷﾝﾘｭｳｼﾞﾁｮｳ","和歌山県","和歌山市","金龍寺丁",0,0,0,0,0,0]
[30201,641,6410001,"ﾜｶﾔﾏｹﾝ","ﾜｶﾔﾏｼ","ｸｲﾉｾ","和歌山県","和歌山市","杭ノ瀬",0,0,0,0,0,0]
[30201,640,6408055,"ﾜｶﾔﾏｹﾝ","ﾜｶﾔﾏｼ","ｸｹﾉﾁｮｳ","和歌山県","和歌山市","九家ノ丁",0,0,0,0,0,0]
[30201,640,6408332,"ﾜｶﾔﾏｹﾝ","ﾜｶﾔﾏｼ","ｸｽｴﾓﾝｼｮｳｼﾞ","和歌山県","和歌山市","楠右衛門小路",0,0,0,0,0,0]
[30201,640,6408463,"ﾜｶﾔﾏｹﾝ","ﾜｶﾔﾏｼ","ｸｽﾐﾅｶ","和歌山県","和歌山市","楠見中",0,0,0,0,0,0]
[30201,64963,6496313,"ﾜｶﾔﾏｹﾝ","ﾜｶﾔﾏｼ","ｸｽﾓﾄ","和歌山県","和歌山市","楠本",0,0,0,0,0,0]
[30201,64003,6400364,"ﾜｶﾔﾏｹﾝ","ﾜｶﾔﾏｼ","ｸﾁｽﾞｻ","和歌山県","和歌山市","口須佐",0,0,0,0,0,0]
[30201,640,6408225,"ﾜｶﾔﾏｹﾝ","ﾜｶﾔﾏｼ","ｸﾎﾞﾁｮｳ","和歌山県","和歌山市","久保丁",0,0,1,0,0,0]
[30201,640,6408333,"ﾜｶﾔﾏｹﾝ","ﾜｶﾔﾏｼ","ｸﾗｼｮｳｼﾞ","和歌山県","和歌山市","蔵小路",0,0,0,0,0,0]
[30201,640,6408305,"ﾜｶﾔﾏｹﾝ","ﾜｶﾔﾏｼ","ｸﾙｽ","和歌山県","和歌山市","栗栖",0,0,0,0,0,0]
[30201,64003,6400311,"ﾜｶﾔﾏｹﾝ","ﾜｶﾔﾏｼ","ｸﾛｲﾜ","和歌山県","和歌山市","黒岩",0,0,0,0,0,0]
[30201,640,6408341,"ﾜｶﾔﾏｹﾝ","ﾜｶﾔﾏｼ","ｸﾛﾀﾞ","和歌山県","和歌山市","黒田",0,0,0,0,0,0]
[30201,64003,6400312,"ﾜｶﾔﾏｹﾝ","ﾜｶﾔﾏｼ","ｸﾛﾀﾞﾆ","和歌山県","和歌山市","黒谷",0,0,0,0,0,0]
[30201,64003,6400345,"ﾜｶﾔﾏｹﾝ","ﾜｶﾔﾏｼ","ｸﾜﾔﾏ","和歌山県","和歌山市","桑山",0,0,0,0,0,0]
[30201,640,6408337,"ﾜｶﾔﾏｹﾝ","ﾜｶﾔﾏｼ","ｹｶﾞﾜﾔﾁｮｳ","和歌山県","和歌山市","毛革屋丁",0,0,0,0,0,0]
[30201,641,6410014,"ﾜｶﾔﾏｹﾝ","ﾜｶﾔﾏｼ","ｹﾐ","和歌山県","和歌山市","毛見",0,0,0,0,0,0]
[30201,640,6408220,"ﾜｶﾔﾏｹﾝ","ﾜｶﾔﾏｼ","ｹﾞﾉﾏﾁ","和歌山県","和歌山市","下町",0,0,0,0,0,0]
[30201,640,6408075,"ﾜｶﾔﾏｹﾝ","ﾜｶﾔﾏｼ","ｹﾞﾝｿﾞｳﾊﾞﾊﾞ","和歌山県","和歌山市","源蔵馬場",0,0,1,0,0,0]
[30201,640,6408314,"ﾜｶﾔﾏｹﾝ","ﾜｶﾔﾏｼ","ｺｳｻﾞｷ","和歌山県","和歌山市","神前",0,0,0,0,0,0]
[30201,64963,6496315,"ﾜｶﾔﾏｹﾝ","ﾜｶﾔﾏｼ","ｺｳﾅﾐ","和歌山県","和歌山市","神波",0,0,0,0,0,0]
[30201,641,6410007,"ﾜｶﾔﾏｹﾝ","ﾜｶﾔﾏｼ","ｺｻﾞｲｶ","和歌山県","和歌山市","小雑賀",0,0,1,0,0,0]
[30201,64003,6400323,"ﾜｶﾔﾏｹﾝ","ﾜｶﾔﾏｼ","ｺｾﾞﾀ","和歌山県","和歌山市","小瀬田",0,0,0,0,0,0]
[30201,640,6408141,"ﾜｶﾔﾏｹﾝ","ﾜｶﾔﾏｼ","ｺﾞﾊﾞﾝﾁｮｳ","和歌山県","和歌山市","五番丁",0,0,0,0,0,0]
[30201,640,6408373,"ﾜｶﾔﾏｹﾝ","ﾜｶﾔﾏｼ","ｺﾋﾞｷﾁｮｳ","和歌山県","和歌山市","木挽丁",0,0,0,0,0,0]
[30201,640,6408226,"ﾜｶﾔﾏｹﾝ","ﾜｶﾔﾏｼ","ｺﾋﾞﾄﾏﾁ","和歌山県","和歌山市","小人町",0,0,0,0,0,0]
[30201,640,6408228,"ﾜｶﾔﾏｹﾝ","ﾜｶﾔﾏｼ","ｺﾋﾞﾄﾏﾁﾐﾅﾐﾉﾁｮｳ","和歌山県","和歌山市","小人町南ノ丁",0,0,0,0,0,0]
[30201,64003,6400301,"ﾜｶﾔﾏｹﾝ","ﾜｶﾔﾏｼ","ｺﾏｸﾗ","和歌山県","和歌山市","木枕",0,0,0,0,0,0]
[30201,640,6408265,"ﾜｶﾔﾏｹﾝ","ﾜｶﾔﾏｼ","ｺﾏﾂﾊﾞﾗ","和歌山県","和歌山市","小松原",0,0,1,0,0,0]
[30201,640,6408269,"ﾜｶﾔﾏｹﾝ","ﾜｶﾔﾏｼ","ｺﾏﾂﾊﾞﾗﾄﾞｵﾘ","和歌山県","和歌山市","小松原通",0,0,1,0,0,0]
[30201,640,6408027,"ﾜｶﾔﾏｹﾝ","ﾜｶﾔﾏｼ","ｺﾒﾔﾏﾁ","和歌山県","和歌山市","米屋町",0,0,0,0,0,0]
[30201,640,6408435,"ﾜｶﾔﾏｹﾝ","ﾜｶﾔﾏｼ","ｺﾔ","和歌山県","和歌山市","古屋",0,0,0,0,0,0]
[30201,641,6410062,"ﾜｶﾔﾏｹﾝ","ﾜｶﾔﾏｼ","ｻｲｶｻﾞｷ","和歌山県","和歌山市","雑賀崎",0,0,0,0,0,0]
[30201,640,6408108,"ﾜｶﾔﾏｹﾝ","ﾜｶﾔﾏｼ","ｻｲｶﾏﾁ","和歌山県","和歌山市","雑賀町",0,0,0,0,0,0]
[30201,640,6408121,"ﾜｶﾔﾏｹﾝ","ﾜｶﾔﾏｼ","ｻｲｶﾐﾁ","和歌山県","和歌山市","雑賀道",0,0,0,0,0,0]
[30201,640,6408249,"ﾜｶﾔﾏｹﾝ","ﾜｶﾔﾏｼ","ｻｲｶﾔﾏﾁ","和歌山県","和歌山市","雑賀屋町",0,0,0,0,0,0]
[30201,640,6408241,"ﾜｶﾔﾏｹﾝ","ﾜｶﾔﾏｼ","ｻｲｶﾔﾏﾁﾋｶﾞｼﾉﾁｮｳ","和歌山県","和歌山市","雑賀屋町東ノ丁",0,0,0,0,0,0]
[30201,640,6408237,"ﾜｶﾔﾏｹﾝ","ﾜｶﾔﾏｼ","ｻﾞｲﾓｸﾁｮｳ","和歌山県","和歌山市","材木丁",0,0,0,0,0,0]
[30201,64003,6400313,"ﾜｶﾔﾏｹﾝ","ﾜｶﾔﾏｼ","ｻｶｲﾊﾞﾗ","和歌山県","和歌山市","境原",0,0,0,0,0,0]
[30201,640,6408441,"ﾜｶﾔﾏｹﾝ","ﾜｶﾔﾏｼ","ｻｶｴﾀﾞﾆ","和歌山県","和歌山市","栄谷",0,0,0,0,0,0]
[30201,641,6410003,"ﾜｶﾔﾏｹﾝ","ﾜｶﾔﾏｼ","ｻｶﾀﾞ","和歌山県","和歌山市","坂田",0,0,0,0,0,0]
[30201,640,6408053,"ﾜｶﾔﾏｹﾝ","ﾜｶﾔﾏｼ","ｻｷﾞﾉﾓﾘ","和歌山県","和歌山市","鷺ノ森",0,0,0,0,0,0]
[30201,640,6408054,"ﾜｶﾔﾏｹﾝ","ﾜｶﾔﾏｼ","ｻｷﾞﾉﾓﾘｶﾀﾏﾁ","和歌山県","和歌山市","鷺ノ森片町",0,0,0,0,0,0]
[30201,640,6408057,"ﾜｶﾔﾏｹﾝ","ﾜｶﾔﾏｼ","ｻｷﾞﾉﾓﾘｼﾝﾐﾁ","和歌山県","和歌山市","鷺ノ森新道",0,0,0,0,0,0]
[30201,640,6408052,"ﾜｶﾔﾏｹﾝ","ﾜｶﾔﾏｼ","ｻｷﾞﾉﾓﾘﾄﾞｳﾏｴﾁｮｳ","和歌山県","和歌山市","鷺ノ森堂前丁",0,0,0,0,0,0]
[30201,640,6408058,"ﾜｶﾔﾏｹﾝ","ﾜｶﾔﾏｼ","ｻｷﾞﾉﾓﾘﾅｶﾉﾁｮｳ","和歌山県","和歌山市","鷺ノ森中ノ丁",0,0,0,0,0,0]
[30201,640,6408051,"ﾜｶﾔﾏｹﾝ","ﾜｶﾔﾏｼ","ｻｷﾞﾉﾓﾘﾋｶﾞｼﾉﾁｮｳ","和歌山県","和歌山市","鷺ノ森東ノ丁",0,0,0,0,0,0]
[30201,640,6408056,"ﾜｶﾔﾏｹﾝ","ﾜｶﾔﾏｼ","ｻｷﾞﾉﾓﾘﾆｼﾉﾁｮｳ","和歌山県","和歌山市","鷺ノ森西ノ丁",0,0,0,0,0,0]
[30201,640,6408047,"ﾜｶﾔﾏｹﾝ","ﾜｶﾔﾏｼ","ｻｷﾞﾉﾓﾘﾐﾅﾐﾉﾁｮｳ","和歌山県","和歌山市","鷺ノ森南ノ丁",0,0,0,0,0,0]
[30201,640,6408059,"ﾜｶﾔﾏｹﾝ","ﾜｶﾔﾏｼ","ｻｷﾞﾉﾓﾘﾐｮｳｼﾞﾝﾁｮｳ","和歌山県","和歌山市","鷺ノ森明神丁",0,0,0,0,0,0]
[30201,640,6408276,"ﾜｶﾔﾏｹﾝ","ﾜｶﾔﾏｼ","ｻｸｼﾞﾁｮｳ","和歌山県","和歌山市","作事丁",0,0,0,0,0,0]
[30201,64963,6496311,"ﾜｶﾔﾏｹﾝ","ﾜｶﾔﾏｼ","ｻﾄ","和歌山県","和歌山市","里",0,0,0,0,0,0]
[30201,64003,6400303,"ﾜｶﾔﾏｹﾝ","ﾜｶﾔﾏｼ","ｻﾝﾄﾞｳﾅｶ","和歌山県","和歌山市","山東中",0,0,0,0,0,0]
[30201,640,6408142,"ﾜｶﾔﾏｹﾝ","ﾜｶﾔﾏｼ","ｻﾝﾊﾞﾝﾁｮｳ","和歌山県","和歌山市","三番丁",0,0,0,0,0,0]
[30201,64003,6400306,"ﾜｶﾔﾏｹﾝ","ﾜｶﾔﾏｼ","ｼｵﾉﾀﾆ","和歌山県","和歌山市","塩ノ谷",0,0,0,0,0,0]
[30201,640,6408122,"ﾜｶﾔﾏｹﾝ","ﾜｶﾔﾏｼ","ｼｵﾐﾁｮｳ","和歌山県","和歌山市","汐見町",0,0,1,0,0,0]
[30201,641,6410054,"ﾜｶﾔﾏｹﾝ","ﾜｶﾔﾏｼ","ｼｵﾔ","和歌山県","和歌山市","塩屋",0,0,1,0,0,0]
[30201,640,6408156,"ﾜｶﾔﾏｹﾝ","ﾜｶﾔﾏｼ","ｼﾁﾊﾞﾝﾁｮｳ","和歌山県","和歌山市","七番丁",0,0,0,0,0,0]
[30201,640,6408267,"ﾜｶﾔﾏｹﾝ","ﾜｶﾔﾏｼ","ｼﾊﾞﾉﾁｮｳ","和歌山県","和歌山市","芝ノ丁",0,0,0,0,0,0]
[30201,64963,6496314,"ﾜｶﾔﾏｹﾝ","ﾜｶﾔﾏｼ","ｼﾏ","和歌山県","和歌山市","島",0,0,0,0,0,0]
[30201,640,6408125,"ﾜｶﾔﾏｹﾝ","ﾜｶﾔﾏｼ","ｼﾏｻﾞｷﾁｮｳ","和歌山県","和歌山市","島崎町",0,0,1,0,0,0]
[30201,640,6408413,"ﾜｶﾔﾏｹﾝ","ﾜｶﾔﾏｼ","ｼﾏﾊﾞｼﾋｶﾞｼﾉﾁｮｳ","和歌山県","和歌山市","島橋東ノ丁",0,0,0,0,0,0]
[30201,640,6408414,"ﾜｶﾔﾏｹﾝ","ﾜｶﾔﾏｼ","ｼﾏﾊﾞｼﾆｼﾉﾁｮｳ","和歌山県","和歌山市","島橋西ノ丁",0,0,0,0,0,0]
[30201,640,6408415,"ﾜｶﾔﾏｹﾝ","ﾜｶﾔﾏｼ","ｼﾏﾊﾞｼﾐﾅﾐﾉﾁｮｳ","和歌山県","和歌山市","島橋南ノ丁",0,0,0,0,0,0]
[30201,640,6408416,"ﾜｶﾔﾏｹﾝ","ﾜｶﾔﾏｼ","ｼﾏﾊﾞｼｷﾀﾉﾁｮｳ","和歌山県","和歌山市","島橋北ノ丁",0,0,0,0,0,0]
[30201,64962,6496263,"ﾜｶﾔﾏｹﾝ","ﾜｶﾔﾏｼ","ｼﾓﾐｹ","和歌山県","和歌山市","下三毛",0,0,0,0,0,0]
[30201,64963,6496325,"ﾜｶﾔﾏｹﾝ","ﾜｶﾔﾏｼ","ｼﾓﾜｻ","和歌山県","和歌山市","下和佐",0,0,0,0,0,0]
[30201,640,6408074,"ﾜｶﾔﾏｹﾝ","ﾜｶﾔﾏｼ","ｼﾝｷﾞｮﾏﾁ","和歌山県","和歌山市","新魚町",0,0,0,0,0,0]
[30201,640,6408101,"ﾜｶﾔﾏｹﾝ","ﾜｶﾔﾏｼ","ｼﾝｻｲｶﾏﾁ","和歌山県","和歌山市","新雑賀町",0,0,0,0,0,0]
[30201,640,6408377,"ﾜｶﾔﾏｹﾝ","ﾜｶﾔﾏｼ","ｼﾝｻｶｲﾁｮｳ","和歌山県","和歌山市","新堺丁",0,0,0,0,0,0]
[30201,640,6408345,"ﾜｶﾔﾏｹﾝ","ﾜｶﾔﾏｼ","ｼﾝｻﾞｲｹ","和歌山県","和歌山市","新在家",0,0,0,0,0,0]
[30201,64962,6496264,"ﾜｶﾔﾏｹﾝ","ﾜｶﾔﾏｼ","ｼﾝｼﾞｮｳ","和歌山県","和歌山市","新庄",0,0,0,0,0,0]
[30201,640,6408325,"ﾜｶﾔﾏｹﾝ","ﾜｶﾔﾏｼ","ｼﾝｾｲﾁｮｳ","和歌山県","和歌山市","新生町",0,0,0,0,0,0]
[30201,640,6408372,"ﾜｶﾔﾏｹﾝ","ﾜｶﾔﾏｼ","ｼﾝﾀﾞｲｸﾏﾁ","和歌山県","和歌山市","新大工町",0,0,0,0,0,0]
[30201,640,6408111,"ﾜｶﾔﾏｹﾝ","ﾜｶﾔﾏｼ","ｼﾝﾄｵﾘ","和歌山県","和歌山市","新通",0,0,1,0,0,0]
[30201,641,6410002,"ﾜｶﾔﾏｹﾝ","ﾜｶﾔﾏｼ","ｼﾝﾅｶｼﾞﾏ","和歌山県","和歌山市","新中島",0,0,0,0,0,0]
[30201,640,6408376,"ﾜｶﾔﾏｹﾝ","ﾜｶﾔﾏｼ","ｼﾝﾅｶﾄﾞｵﾘ","和歌山県","和歌山市","新中通",0,0,1,0,0,0]
[30201,641,6410042,"ﾜｶﾔﾏｹﾝ","ﾜｶﾔﾏｼ","ｼﾝﾎﾞﾘﾋｶﾞｼ","和歌山県","和歌山市","新堀東",0,0,1,0,0,0]
[30201,640,6408371,"ﾜｶﾔﾏｹﾝ","ﾜｶﾔﾏｼ","ｼﾝﾔｵﾔﾁｮｳ","和歌山県","和歌山市","新八百屋丁",0,0,0,0,0,0]
[30201,641,6410023,"ﾜｶﾔﾏｹﾝ","ﾜｶﾔﾏｼ","ｼﾝﾜｶｳﾗ","和歌山県","和歌山市","新和歌浦",0,0,0,0,0,0]
[30201,640,6408152,"ﾜｶﾔﾏｹﾝ","ﾜｶﾔﾏｼ","ｼﾞｭｳﾊﾞﾝﾁｮｳ","和歌山県","和歌山市","十番丁",0,0,0,0,0,0]
[30201,640,6408159,"ﾜｶﾔﾏｹﾝ","ﾜｶﾔﾏｼ","ｼﾞｭｳｲﾁﾊﾞﾝﾁｮｳ","和歌山県","和歌山市","十一番丁",0,0,0,0,0,0]
[30201,640,6408158,"ﾜｶﾔﾏｹﾝ","ﾜｶﾔﾏｼ","ｼﾞｭｳﾆﾊﾞﾝﾁｮｳ","和歌山県","和歌山市","十二番丁",0,0,0,0,0,0]
[30201,640,6408150,"ﾜｶﾔﾏｹﾝ","ﾜｶﾔﾏｼ","ｼﾞｭｳｻﾝﾊﾞﾝﾁｮｳ","和歌山県","和歌山市","十三番丁",0,0,0,0,0,0]
{"$rows_left_out":1434}